Konuyu Oyla:
  • Toplam: 0 Oy - Ortalama: 0
Share Thread:
Rasbian'a Opencv 3.1.0 kurarken Cmake hatası
#1
Raspberry pi 2 ye Opencv 3.1.0 yüklemeye çalışıyorum ama hata alıyorum. Noobs olarak sd karta yükleme yapmıştım başta. Onunla bi ilgisi olabilir mi? 


cmake -D CMAKE_BUILD_TYPE=RELEASE \
-D CMAKE_INSTALL_PREFIX=/usr/local \
-D INSTALL_C_EXAMPLES=OFF \
-D INSTALL_PYTHON_EXAMPLES=ON \
-D OPENCV_EXTRA_MODULES_PATH=~/opencv_contrib-3.0.0/modules \
-D BUILD_EXAMPLES=ON ..




İndirme yaparken bu kodu girdiğimde işlem tamamlandığında sonda incompleted yazıyor ve 'see also ... cmakefiles/cmakeerrors.log' diyor. Neyden kaynaklı bir hata olabilir sizce?
Ara
Cevapla
#2
https://gist.github.com/willprice/c216fcbeba8d14ad1138

Yüklemeyi bide şurdaki sh ile deneyin belki işe yarar.

Ayrıca sudo apt-get install build-essential cmake cmake-curses-gui \
                              pkg-config libpng12-0 libpng12-dev libpng++-dev \
                              libpng3 libpnglite-dev zlib1g-dbg zlib1g zlib1g-dev \
                              pngtools libtiff4-dev libtiff4 libtiffxx0c2 libtiff-tools libeigen3-dev


sudo apt-get install libjpeg8 libjpeg8-dev libjpeg8-dbg libjpeg-progs \
                              ffmpeg libavcodec-dev libavcodec53 libavformat53 \
                              libavformat-dev libxine1-ffmpeg libxine-dev libxine1-bin \
                              libunicap2 libunicap2-dev swig libv4l-0 libv4l-dev \
                              python-numpy libpython2.6 python-dev python2.6-dev libgtk2.0-dev

Bunları kurmanız gerekli sanıyorum.
Arch- KTM - Epiphone -  Raspi   Rolleyes
Ara
Cevapla
#3
Teşekkürler. Birdaha deneyeyim umarım yine hata vermez.
Ara
Cevapla
#4
sudo apt-get install libjpeg8 libjpeg8-dev libjpeg8-dbg libjpeg-progs \
                              ffmpeg libavcodec-dev libavcodec53 libavformat53 \
                              libavformat-dev libxine1-ffmpeg libxine-dev libxine1-bin \
                              libunicap2 libunicap2-dev swig libv4l-0 libv4l-dev \
                              python-numpy libpython2.6 python-dev python2.6-dev libgtk2.0-dev

kısmını kurmayı denediğimde 

Package ffmpeg is not available, but is referred to by another package.

This may mean that the package is missing, has been obsoleted, or

is only available from another source



E: Package 'ffmpeg' has no installation candidate

E: Unable to locate package libavcodec53

E: Unable to locate package libavformat53

E: Unable to locate package libxine1-ffmpeg

E: Unable to locate package libxine1-bin

E: Unable to locate package libpython2.6

E: Couldn't find any package by regex 'libpython2.6'

E: Unable to locate package python2.6-dev
E: Couldn't find any package by regex 'python2.6-dev'

diye hata alıyorum. ffmpeg is not available demişti daha önceki yüklememde de. Bunu nasıl halledebilirim?
Ara
Cevapla
#5
Linkteki sh dosyasını kullan zaten gerekli olan programları kuruyor o. Alttaki komutları uygula sonrasında sh dosyasını çalıştır.
sudo apt-get update
sudo apt-get upgrade
sudo apt-get install wget unzip


LG-E610 cihazımdan Tapatalk kullanılarak gönderildi
Ara
Cevapla
#6
Peki bu sh dosyasını nereye nasıl kaydedicem?
Ara
Cevapla
#7
Raspberry pi nin içinde çalıştır direk indirip. Wget ile indirebilirsin. Veya bilgisayarından usb ye indir tak raspide çalıştır direk. Bahsettiğim şeyleri yüklüyor o sh scripti
Arch- KTM - Epiphone -  Raspi   Rolleyes
Ara
Cevapla
#8
Direk terminale kopyalayarak çalıştırdım yüklüyor şu an. Umarım hiç hatasız çalışır bu sefer. Teşekkürler.
Ara
Cevapla
#9
In file included from /home/pi/opencv-3.1.0/modules/shape/src/sc_dis.cpp:50:0:
/home/pi/opencv-3.1.0/modules/shape/src/scd_def.hpp:66:30: internal compiler error: Segmentation fault
     void extractSCD(cv::Mat& contour, cv::Mat& descriptors,
                              ^
Please submit a full bug report,
with preprocessed source if appropriate.
See <file:///usr/share/doc/gcc-4.9/README.Bugs> for instructions.
Preprocessed source stored into /tmp/ccfmNy5v.out file, please attach this to your bugreport.
modules/shape/CMakeFiles/opencv_shape.dir/build.make:54: recipe for target 'modules/shape/CMakeFiles/opencv_shape.dir/src/sc_dis.cpp.o' failed
make[2]: *** [modules/shape/CMakeFiles/opencv_shape.dir/src/sc_dis.cpp.o] Error 1
CMakeFiles/Makefile2:5508: recipe for target 'modules/shape/CMakeFiles/opencv_shape.dir/all' failed
make[1]: *** [modules/shape/CMakeFiles/opencv_shape.dir/all] Error 2
Makefile:147: recipe for target 'all' failed
make: *** [all] Error 2



 En son bu şekilde hata verdi yine. %62 dolmuştu. Yine gitti.
Ara
Cevapla
#10
arkadaşlar iyi günler;

Daha önceden kurduğum raspberryb pi 3 artık açılmıyor. Sadece kırmızı ışık yanıyor yeşil ışık yanmıyor. Sıfır bir SD kart alıp üzerine Jessie kurdum. Ancak yine kar etmedi. Ne yapmam gerekir?
Ara
Cevapla


Konu ile Alakalı Benzer Konular
Konular Yazar Yorumlar Okunma Son Yorum
  Rasbian ve Ubuntu aynı monitörde Engineer 1 2,000 11-23-2019, 07:30 AM
Son Yorum: cprogrammer
  [Soru] Rasbian Boot Sırasını Değişmek baseroguzhan 3 2,590 11-06-2017, 02:29 PM
Son Yorum: aliyolcu
  c# ve Rasbian voltajer 7 6,757 01-26-2016, 01:47 PM
Son Yorum: mrtsrcm
  [Soru] Libre Office kurulumundan sonra Rasbian açılmıyor BURAKHAYIRLI 7 5,434 03-30-2015, 06:47 PM
Son Yorum: BURAKHAYIRLI

Hızlı Menü:


Konuyu Okuyanlar: 1 Ziyaretçi